{"text_format":"1","workbook":"xlsx","n_sheets":8,"sheets":["About","VRP Solver Console","MultiLanguageMenuItems","MultiLanguageInterface","1.Locations","2.Distances","3.Vehicles","4.Solution"],"not_rendered":{"charts":0,"images":0,"macros":1,"external_links":0,"defined_names":3,"comments":0,"pivot_tables":0},"unopened":[],"bounds":{"document_bytes":16777216,"sheet_cells":100000,"rows_first":2000,"rows_last":500,"rows_between":2000,"halvings":0,"cell_chars":16384,"cell_head_chars":4096},"cells_cut":0,"cells_raw":0,"read":"whole","date_system":"1900"}

{"sheet":"About","index":0,"n_rows":4,"n_cols":1,"rows_kept":4,"cut":false,"hidden":true,"merged":[]}
["Developed by Dr Güneş Erdoğan, 2020."]
["School of Management, University of Bath."]
[]
["DISCLAIMER: THIS SOFTWARE IS PROVIDED \"AS IS\" AND ANY EXPRESS OR IMPLIED WARRANTIES, INCLUDING, BUT NOT LIMITED TO, THE IMPLIED WARRANTIES OF MERCHANTABILITY AND FITNESS FOR A PARTICULAR PURPOSE ARE DISCLAIMED. IN NO EVENT SHALL THE ORIGINAL DEVELOPER BE LIABLE FOR ANY DIRECT, INDIRECT, INCIDENTAL, SPECIAL, EXEMPLARY, OR CONSEQUENTIAL DAMAGES (INCLUDING, BUT NOT LIMITED TO, PROCUREMENT OF SUBSTITUTE GOODS OR SERVICES; LOSS OF USE, DATA, OR PROFITS; OR BUSINESS INTERRUPTION) HOWEVER CAUSED AND ON ANY THEORY OF LIABILITY,  WHETHER IN CONTRACT, STRICT LIABILITY, OR TORT (INCLUDING NEGLIGENCE OR OTHERWISE) ARISING IN ANY WAY OUT OF THE USE OF THIS SOFTWARE, EVEN IF ADVISED OF THE POSSIBILITY OF SUCH DAMAGE."]

{"sheet":"VRP Solver Console","index":1,"n_rows":26,"n_cols":4,"rows_kept":26,"cut":false,"hidden":false,"merged":[]}
["Sequence","Parameter","Value","Remarks"]
["0.Interface","Language","English","Please refer to the manual for modifying the interface."]
[null,"Optional - Bing Maps Key",null,"You can get a free trial key at https://www.bingmapsportal.com/"]
[]
["1.Locations","Number of depots",1,"[1, 20]"]
[null,"Number of customers",5,"[5, 200]"]
[]
["2.Distances","Distance computation method","Bing Maps driving distances (km)","Recommendation: Use 'postcode, country' format for addresses"]
{"$rows_left_out":19}
{"sheet":"MultiLanguageMenuItems","index":2,"n_rows":27,"n_cols":15,"rows_kept":27,"cut":false,"hidden":true,"merged":[]}
["Menu Item","English","Türkçe","Deutsche","Espanola","Française","Italiano","Português","عربى","Bahasa Indonesia","اردو","বাংলা","Kiswahili","فارسی","Bahasa Melayu"]
["VRPSpreadsheetSolver","VRP Spreadsheet Solver","VRP Excel Çözücü","VRP Spreadsheet Solver","Solucionador de hojas de cálculo VRP","Solveur de feuille de calcul VRP","Risolutore di fogli di calcolo VRP","VRP Spreadsheet Solver","VRP Spreadsheet Solver","VRP Spreadsheet Solver","وی آر پی اسپریڈشیٹ حل کرنے والا","ভিআরপি স্প্রেডশিট সলভার","Solver Lahajedwali ya VRP","حل صفحه گسترده VRP","Penyelesaian Hamparan VRP"]
["menu1","0. Reset","0. Sıfırla","0. Zurücksetzen","0. Restablecer","0. Réinitialiser","0. Reimposta","0. Reiniciar","0. إعادة","0. Atur ulang","0. ری سیٹ کریں","0. পুনরায় সেট করুন","0. Weka upya","0. تنظیم مجدد","0. Tetapkan semula"]
["customButton1","0. Reset the workbook","0. Çalışma kitabını sıfırlayın","0. Setzen Sie die Arbeitsmappe zurück","0. Restablecer el libro de trabajo","0. Réinitialiser le classeur","0. Reimpostare la cartella di lavoro","0. Reinicialize a pasta de trabalho","0. إعادة تعيين المصنف","0. Atur ulang buku kerja","0. ورک بک کو دوبارہ ترتیب دیں","0. ওয়ার্কবুকটি রিসেট করুন","0. Rudisha kitabu cha kazi","0. کتاب کار را بازنشانی کنید","0. Tetapkan semula buku kerja"]
["menu2","1. Locations","1. Konumlar","1. Standorte","1. Ubicaciones","1. Lieux","1. Posizioni","1. Localizações","1. المواقع","1. Lokasi","1. مقامات","1. অবস্থান","1. Maeneo","1. مکان ها","1. Lokasi"]
["customButton2","1.1. Setup Locations Worksheet","1.1. Konumlar Çalışma Sayfası Kurulumu","1.1. Arbeitsblatt \"Standorte einrichten\"","1.1. Hoja de trabajo de configuración de ubicaciones","1.1. Feuille de calcul des emplacements de configuration","1.1. Foglio di lavoro delle posizioni di installazione","1.1. Planilha de locais de configuração","1.1. إعداد ورقة عمل المواقع","1.1. Atur Lembar Kerja Lokasi","1.1۔ مقامات کی ورک شیٹ سیٹ اپ کریں","1.1। অবস্থানগুলির কার্যপত্রক সেটআপ করুন","1.1. Sanidi Karatasi ya Maeneo ya Maeneo","1.1 کاربرگ مکانها را تنظیم کنید","1.1. Lembar Kerja Lokasi Persediaan"]
["customButton3","1.2. Populate Lat/Lon using addresses","1.2. Adresleri kullanarak Enlem / Boylam bulun","1.2. Füllen Sie Lat / Lon mit Adressen","1.2. Complete Lat / Lon usando direcciones","1.2. Remplir Lat / Lon à l'aide d'adresses","1.2. Popolare Lat / Lon utilizzando gli indirizzi","1.2. Preencher Lat / Lon usando endereços","1.2 قم بتعبئة خطوط الطول والخط باستخدام العناوين","1.2. Isi Lintang / Bujur menggunakan alamat","1.2۔ پتے استعمال کرکے لیٹ / لون آباد کریں","১.২ ঠিকানা ব্যবহার করে ল্যাট / লনকে জনসংখ্যা দিন","1.2. Jaza watu Lat / Lon ukitumia anwani","1.2 Lat / Lon را با استفاده از آدرسها جمع کنید","1.2. Isi Lat / Lon menggunakan alamat"]
["customButton4","1.3. Sort locations alphabetically","1.3. Yerleri alfabetik olarak sıralayın","1.3. Standorte alphabetisch sortieren","1.3. Ordenar ubicaciones alfabéticamente","1.3. Trier les emplacements par ordre alphabétique","1.3. Ordina le posizioni in ordine alfabetico","1.3. Classifique os locais em ordem alfabética","1.3 فرز المواقع أبجديا","1.3. Urutkan lokasi menurut abjad","1.3۔ حروف تہجی کے لحاظ سے مقامات کی ترتیب دیں","1.3। বর্ণমালা অনুসারে অবস্থানগুলি বাছাই করুন","1.3. Panga maeneo kwa herufi","1.3 مرتب سازی بر اساس حروف الفبا","1.3. Isih lokasi mengikut abjad"]
{"$rows_left_out":20}
{"sheet":"MultiLanguageInterface","index":3,"n_rows":292,"n_cols":14,"rows_kept":292,"cut":false,"hidden":true,"merged":[]}
["English","Türkçe","Deutsche","Espanola","Française","Italiano","Português","عربى","Bahasa Indonesia","اردو","বাংলা","Kiswahili","فارسی","Bahasa Melayu"]
[" cannot be served with the given working time limit."," verilen çalışma süresi sınırı ile servis yapılamaz."," kann nicht mit der angegebenen Arbeitszeit bedient werden."," no se puede servir con el límite de tiempo de trabajo dado."," ne peut pas être servi avec la limite de temps de travail indiquée."," non può essere servito con il limite di tempo di lavoro specificato."," não pode ser servido com o limite de tempo de trabalho fornecido."," لا يمكن تقديمه مع حد وقت العمل المحدد.","tidak dapat dilayani dengan batas waktu kerja yang ditentukan.","کام کرنے کی مقررہ مدت کے ساتھ خدمت نہیں کی جاسکتی ہے۔","প্রদত্ত কাজের সময়সীমা দিয়ে পরিবেশন করা যাবে না।"," haiwezi kutumiwa na kikomo cha muda uliopewa wa kufanya kazi.","با محدودیت زمان کار داده شده قابل ارائه نیست."," tidak dapat dilayan dengan had masa kerja yang diberikan."]
[" cannot be visited with the given distance limit."," verilen mesafe sınırı ile ziyaret edilemez."," kann mit dem angegebenen Entfernungslimit nicht besucht werden."," no se puede visitar con el límite de distancia dado."," ne peut pas être visité avec la limite de distance donnée."," non può essere visitato con il limite di distanza indicato."," não pode ser visitado com o limite de distância fornecido."," لا يمكن زيارته مع حد المسافة المحدد."," tidak dapat dikunjungi dengan batas jarak yang ditentukan."," مقررہ فاصلہ کی حد کے ساتھ دورہ نہیں کیا جاسکتا۔"," প্রদত্ত দুরত্ব সীমা দিয়ে পরিদর্শন করা যাবে না।"," haiwezi kutembelewa na kikomo cha umbali uliopewa."," با محدودیت فاصله داده شده قابل بازدید نیست."," tidak dapat dikunjungi dengan had jarak yang diberikan."]
[" cannot be visited with the given driving time limit."," verilen sürüş süresi sınırı ile ziyaret edilemez."," kann nicht mit der angegebenen Fahrzeit besucht werden."," no se puede visitar con el límite de tiempo de conducción dado."," ne peut pas être visité avec le temps de conduite donné."," non può essere visitato con il limite di tempo di guida indicato."," não pode ser visitado com o limite de tempo de condução fornecido."," لا يمكن زيارته مع الوقت المحدد للقيادة."," tidak dapat dikunjungi dengan batas waktu mengemudi yang ditentukan."," ڈرائیونگ کی دی گئی وقت کی حد کے ساتھ تشریف نہیں لیا جاسکتا۔"," প্রদত্ত ড্রাইভিংয়ের সময়সীমা সহ পরিদর্শন করা যাবে না।"," haiwezi kutembelewa na kikomo cha wakati wa kuendesha."," با محدودیت زمان رانندگی قابل بازدید نیست."," tidak dapat dikunjungi dengan had masa memandu yang diberikan."]
[" complete."," tamamlandı.","Komplett.","completar.","Achevée.","completare.","completo.","اكتمال."," lengkap."," مکمل"," সম্পূর্ণ"," kamili."," کامل."," lengkap."]
[" exceeds its capacity at stop "," durma anında kapasitesini aşıyor"," überschreitet seine Kapazität beim Anhalten"," excede su capacidad en parada"," dépasse sa capacité à l'arrêt"," supera la sua capacità all'arresto"," excede sua capacidade na parada"," يتجاوز قدرتها عند التوقف"," melebihi kapasitasnya saat berhenti"," اسٹاپ پر اپنی صلاحیت سے تجاوز کرتا ہے"," স্টপ এ তার ক্ষমতা অতিক্রম করে"," inazidi uwezo wake wa kusimama"," بیش از ظرفیت خود در توقف است"," melebihi kapasitinya semasa berhenti"]
[" exceeds the distance limit."," mesafe sınırını aşıyor."," überschreitet die Entfernungsgrenze."," excede el límite de distancia."," dépasse la limite de distance."," supera il limite di distanza."," excede o limite de distância."," يتجاوز حد المسافة."," melebihi batas jarak."," فاصلہ کی حد سے تجاوز کر گیا"," দূরত্বের সীমা অতিক্রম করে।"," huzidi kikomo cha umbali."," بیش از حد فاصله است."," melebihi had jarak."]
[" exceeds the driving time limit."," sürüş süresi sınırını aşıyor."," überschreitet das Fahrzeitlimit."," excede el límite de tiempo de conducción."," dépasse la limite de temps de conduite."," supera il limite di tempo di guida."," excede o limite de tempo de condução."," يتجاوز وقت القيادة."," melebihi batas waktu mengemudi."," ڈرائیونگ کی وقت کی حد سے تجاوز"," ড্রাইভিং সময় সীমা অতিক্রম করে।"," huzidi kikomo cha muda wa kuendesha."," از محدودیت زمانی رانندگی فراتر می رود."," melebihi had masa memandu."]
{"$rows_left_out":285}
{"sheet":"1.Locations","index":4,"n_rows":7,"n_cols":12,"rows_kept":7,"cut":false,"hidden":false,"merged":[]}
["Location ID","Name","Address","Latitude (y)","Longitude (x)","Time window start","Time window end","Must be visited?","Service time","Pickup amount","Delivery amount","Profit"]
[0,"Depot",null,null,null,"00:00:00","23:59:00","Starting location",0,0,0,0]
[1,"Customer 1",null,null,null,"00:00:00","23:59:00","Must be visited",0,0,37,0]
[2,"Customer 2",null,null,null,"00:00:00","23:59:00","Must be visited",0,0,35,0]
[3,"Customer 3",null,null,null,"00:00:00","23:59:00","Must be visited",0,0,30,0]
[4,"Customer 4",null,null,null,"00:00:00","23:59:00","Must be visited",0,0,25,0]
[5,"Customer 5",null,null,null,"00:00:00","23:59:00","Must be visited",0,0,32,0]

{"sheet":"2.Distances","index":5,"n_rows":38,"n_cols":10,"rows_kept":38,"cut":false,"hidden":false,"merged":[]}
["Method:"]
["From","To","Distance","Duration","Polyline break 1 Latitude (y)","Polyline break 1 Longitude (x)","Polyline break 2 Latitude (y)","Polyline break 2 Longitude (x)","Polyline break 3 Latitude (y)","Polyline break 3 Longitude (x)"]
["Depot","Depot",0,0,{"$f":"'1.Locations'!D2","v":0},{"$f":"'1.Locations'!E2","v":0},{"$f":"'1.Locations'!D2","v":0},{"$f":"'1.Locations'!E2","v":0},{"$f":"'1.Locations'!D2","v":0},{"$f":"'1.Locations'!E2","v":0}]
["Depot","Customer 1",28,0,{"$f":"'1.Locations'!D2","v":0},{"$f":"'1.Locations'!E2","v":0},{"$f":"'1.Locations'!D2","v":0},{"$f":"'1.Locations'!E2","v":0},{"$f":"'1.Locations'!D2","v":0},{"$f":"'1.Locations'!E2","v":0}]
["Depot","Customer 2",31,0,{"$f":"'1.Locations'!D2","v":0},{"$f":"'1.Locations'!E2","v":0},{"$f":"'1.Locations'!D2","v":0},{"$f":"'1.Locations'!E2","v":0},{"$f":"'1.Locations'!D2","v":0},{"$f":"'1.Locations'!E2","v":0}]
["Depot","Customer 3",20,0,{"$f":"'1.Locations'!D2","v":0},{"$f":"'1.Locations'!E2","v":0},{"$f":"'1.Locations'!D2","v":0},{"$f":"'1.Locations'!E2","v":0},{"$f":"'1.Locations'!D2","v":0},{"$f":"'1.Locations'!E2","v":0}]
["Depot","Customer 4",25,0,{"$f":"'1.Locations'!D2","v":0},{"$f":"'1.Locations'!E2","v":0},{"$f":"'1.Locations'!D2","v":0},{"$f":"'1.Locations'!E2","v":0},{"$f":"'1.Locations'!D2","v":0},{"$f":"'1.Locations'!E2","v":0}]
["Depot","Customer 5",34,0,{"$f":"'1.Locations'!D2","v":0},{"$f":"'1.Locations'!E2","v":0},{"$f":"'1.Locations'!D2","v":0},{"$f":"'1.Locations'!E2","v":0},{"$f":"'1.Locations'!D2","v":0},{"$f":"'1.Locations'!E2","v":0}]
{"$rows_left_out":31}
{"sheet":"3.Vehicles","index":6,"n_rows":2,"n_cols":13,"rows_kept":2,"cut":false,"hidden":false,"merged":[]}
["Starting depot","Vehicle type","Capacity","Fixed cost per trip","Cost per unit distance","Duration multiplier","Distance limit","Work start time","Driving time limit","Working time limit","Return depot","Destination ID","Number of vehicles"]
["Depot","T1",100,0,1,1,100000,"00:00:00",0.99930555555555556,0.99930555555555556,"Depot",{"$f":"IFERROR(MATCH(K2,'1.Locations'!$B$2:$B$2,0) - 1,\" \")","v":0},2]

{"sheet":"4.Solution","index":7,"n_rows":13,"n_cols":31,"rows_kept":13,"cut":false,"hidden":false,"merged":[]}
["Total net profit:",{"$f":"+G3+X3","v":-171}]
[]
["Vehicle:","V1",null,"Stops:",{"$f":"COUNTA(B6:B11)","v":4},"Net profit:",{"$f":"INDEX(I5:I11,E3 + 1)-(INDEX(D5:D11,E3+ 1) * '3.Vehicles'!$E$2)- IF(E3 > 1, '3.Vehicles'!$D$2, 0)","v":-95},null,null,null,null,null,null,null,null,null,null,"Vehicle:","V2",null,"Stops:",{"$f":"COUNTA(S6:S11)","v":3},"Net profit:",{"$f":"INDEX(Z5:Z11,V3 + 1)-(INDEX(U5:U11,V3+ 1) * '3.Vehicles'!$E$2)- IF(V3 > 1, '3.Vehicles'!$D$2, 0)","v":-76}]
["Stop count","Location Name","Location ID","Distance travelled","Driving time","Arrival time","Departure time","Working time","Profit collected","Pickup amount","Delivery amount","Cumulative pickup","Subtractive delivery","Load",null,null,null,"Stop count","Location Name","Location ID","Distance travelled","Driving time","Arrival time","Departure time","Working time","Profit collected","Pickup amount","Delivery amount","Cumulative pickup","Subtractive delivery","Load"]
[0,{"$f":"'1.Locations'!$B$2","v":"Depot"},{"$f":"IFERROR(MATCH(B5,'1.Locations'!$B$2:$B$7, 0) - 1,\" \")","v":0},0,0,null,{"$f":"'3.Vehicles'!$H$2","v":"00:00:00"},0,0,0,0,0,{"$f":"IFERROR(IF(ISNUMBER(C5),IF(B6 = B5, 0, IF(B6 = \"\", 0, M6 + K6)),\" \"),\" \")","v":99},{"$f":"IFERROR(IF(ISNUMBER(C5),L5 + M5,\" \"),\" \")","v":99},null,null,null,0,{"$f":"'1.Locations'!$B$2","v":"Depot"},{"$f":"IFERROR(MATCH(S5,'1.Locations'!$B$2:$B$7, 0) - 1,\" \")","v":0},0,0,null,{"$f":"'3.Vehicles'!$H$2","v":"00:00:00"},0,0,0,0,0,{"$f":"IFERROR(IF(ISNUMBER(T5),IF(S6 = S5, 0, IF(S6 = \"\", 0, AD6 + AB6)),\" \"),\" \")","v":60},{"$f":"IFERROR(IF(ISNUMBER(T5),AC5 + AD5,\" \"),\" \")","v":60}]
[1,"Customer 3",{"$f":"IFERROR(MATCH(B6,'1.Locations'!$B$2:$B$7, 0) - 1,\" \")","v":3},{"$f":"IFERROR(IF(ISNUMBER(C6),INDEX('2.Distances'!$C$2:$C$37,C5*6+C6 + 2) +D5,\" \"),\" \")","v":20},{"$f":"IFERROR(IF(ISNUMBER(C6),'3.Vehicles'!$F$2 * INDEX('2.Distances'!$D$2:$D$37,C5*6+C6 + 2) +E5,\" \"),\" \")","v":0},{"$f":"IFERROR(IF(ISNUMBER(C6),'3.Vehicles'!$F$2 * INDEX('2.Distances'!$D$2:$D$37,C5*6+C6 + 2) +G5,\" \"),\" \")","v":"00:00:00"},{"$f":"IFERROR(IF(AND(C5<>C6,ISNUMBER(F6)),INDEX('1.Locations'!$I$2:$I$7,C6 + 1) + MAX(F6,INDEX('1.Locations'!$F$2:$F$7,C6 + 1)),\" \"),\" \")","v":"00:00:00"},{"$f":"IFERROR(IF(AND(B6 = B5, B7 = \"\"), F6 - G5, G6 - G5),\" \")","v":0},{"$f":"IFERROR(IF(ISNUMBER(C6),INDEX('1.Locations'!$L$2:$L$7,C6 + 1) + I5,\" \"),\" \")","v":0},{"$f":"IFERROR(IF(ISNUMBER(C6),INDEX('1.Locations'!$J$2:$J$7,C6 + 1),\" \"),\" \")","v":0},{"$f":"IFERROR(IF(ISNUMBER(C6),INDEX('1.Locations'!$K$2:$K$7,C6 + 1),\" \"),\" \")","v":30},{"$f":"IFERROR(IF(ISNUMBER(C6),IF(B6 = B5, 0, J6 + L5),\" \"),\" \")","v":0},{"$f":"IFERROR(IF(ISNUMBER(C6),IF(B7 = B5, 0, IF(B7 = \"\", 0, M7 + K7)),\" \"),\" \")","v":69},{"$f":"IFERROR(IF(ISNUMBER(C6),L6 + M6,\" \"),\" \")","v":69},null,null,null,1,"Customer 4",{"$f":"IFERROR(MATCH(S6,'1.Locations'!$B$2:$B$7, 0) - 1,\" \")","v":4},{"$f":"IFERROR(IF(ISNUMBER(T6),INDEX('2.Distances'!$C$2:$C$37,T5*6+T6 + 2) +U5,\" \"),\" \")","v":25},{"$f":"IFERROR(IF(ISNUMBER(T6),'3.Vehicles'!$F$2 * INDEX('2.Distances'!$D$2:$D$37,T5*6+T6 + 2) +V5,\" \"),\" \")","v":0},{"$f":"IFERROR(IF(ISNUMBER(T6),'3.Vehicles'!$F$2 * INDEX('2.Distances'!$D$2:$D$37,T5*6+T6 + 2) +X5,\" \"),\" \")","v":"00:00:00"},{"$f":"IFERROR(IF(AND(T5<>T6,ISNUMBER(W6)),INDEX('1.Locations'!$I$2:$I$7,T6 + 1) + MAX(W6,INDEX('1.Locations'!$F$2:$F$7,T6 + 1)),\" \"),\" \")","v":"00:00:00"},{"$f":"IFERROR(IF(AND(S6 = S5, S7 = \"\"), W6 - X5, X6 - X5),\" \")","v":0},{"$f":"IFERROR(IF(ISNUMBER(T6),INDEX('1.Locations'!$L$2:$L$7,T6 + 1) + Z5,\" \"),\" \")","v":0},{"$f":"IFERROR(IF(ISNUMBER(T6),INDEX('1.Locations'!$J$2:$J$7,T6 + 1),\" \"),\" \")","v":0},{"$f":"IFERROR(IF(ISNUMBER(T6),INDEX('1.Locations'!$K$2:$K$7,T6 + 1),\" \"),\" \")","v":25},{"$f":"IFERROR(IF(ISNUMBER(T6),IF(S6 = S5, 0, AA6 + AC5),\" \"),\" \")","v":0},{"$f":"IFERROR(IF(ISNUMBER(T6),IF(S7 = S5, 0, IF(S7 = \"\", 0, AD7 + AB7)),\" \"),\" \")","v":35},{"$f":"IFERROR(IF(ISNUMBER(T6),AC6 + AD6,\" \"),\" \")","v":35}]
[2,"Customer 5",{"$f":"IFERROR(MATCH(B7,'1.Locations'!$B$2:$B$7, 0) - 1,\" \")","v":5},{"$f":"IFERROR(IF(ISNUMBER(C7),INDEX('2.Distances'!$C$2:$C$37,C6*6+C7 + 2) +D6,\" \"),\" \")","v":47},{"$f":"IFERROR(IF(ISNUMBER(C7),'3.Vehicles'!$F$2 * INDEX('2.Distances'!$D$2:$D$37,C6*6+C7 + 2) +E6,\" \"),\" \")","v":0},{"$f":"IFERROR(IF(ISNUMBER(C7),'3.Vehicles'!$F$2 * INDEX('2.Distances'!$D$2:$D$37,C6*6+C7 + 2) +G6,\" \"),\" \")","v":"00:00:00"},{"$f":"IFERROR(IF(AND(C5<>C7,ISNUMBER(F7)),INDEX('1.Locations'!$I$2:$I$7,C7 + 1) + MAX(F7,INDEX('1.Locations'!$F$2:$F$7,C7 + 1)),\" \"),\" \")","v":"00:00:00"},{"$f":"IFERROR(IF(AND(B7 = B5, B8 = \"\"), F7 - G5, G7 - G5),\" \")","v":0},{"$f":"IFERROR(IF(ISNUMBER(C7),INDEX('1.Locations'!$L$2:$L$7,C7 + 1) + I6,\" \"),\" \")","v":0},{"$f":"IFERROR(IF(ISNUMBER(C7),INDEX('1.Locations'!$J$2:$J$7,C7 + 1),\" \"),\" \")","v":0},{"$f":"IFERROR(IF(ISNUMBER(C7),INDEX('1.Locations'!$K$2:$K$7,C7 + 1),\" \"),\" \")","v":32},{"$f":"IFERROR(IF(ISNUMBER(C7),IF(B7 = B5, 0, J7 + L6),\" \"),\" \")","v":0},{"$f":"IFERROR(IF(ISNUMBER(C7),IF(B8 = B5, 0, IF(B8 = \"\", 0, M8 + K8)),\" \"),\" \")","v":37},{"$f":"IFERROR(IF(ISNUMBER(C7),L7 + M7,\" \"),\" \")","v":37},null,null,null,2,"Customer 2",{"$f":"IFERROR(MATCH(S7,'1.Locations'!$B$2:$B$7, 0) - 1,\" \")","v":2},{"$f":"IFERROR(IF(ISNUMBER(T7),INDEX('2.Distances'!$C$2:$C$37,T6*6+T7 + 2) +U6,\" \"),\" \")","v":45},{"$f":"IFERROR(IF(ISNUMBER(T7),'3.Vehicles'!$F$2 * INDEX('2.Distances'!$D$2:$D$37,T6*6+T7 + 2) +V6,\" \"),\" \")","v":0},{"$f":"IFERROR(IF(ISNUMBER(T7),'3.Vehicles'!$F$2 * INDEX('2.Distances'!$D$2:$D$37,T6*6+T7 + 2) +X6,\" \"),\" \")","v":"00:00:00"},{"$f":"IFERROR(IF(AND(T5<>T7,ISNUMBER(W7)),INDEX('1.Locations'!$I$2:$I$7,T7 + 1) + MAX(W7,INDEX('1.Locations'!$F$2:$F$7,T7 + 1)),\" \"),\" \")","v":"00:00:00"},{"$f":"IFERROR(IF(AND(S7 = S5, S8 = \"\"), W7 - X5, X7 - X5),\" \")","v":0},{"$f":"IFERROR(IF(ISNUMBER(T7),INDEX('1.Locations'!$L$2:$L$7,T7 + 1) + Z6,\" \"),\" \")","v":0},{"$f":"IFERROR(IF(ISNUMBER(T7),INDEX('1.Locations'!$J$2:$J$7,T7 + 1),\" \"),\" \")","v":0},{"$f":"IFERROR(IF(ISNUMBER(T7),INDEX('1.Locations'!$K$2:$K$7,T7 + 1),\" \"),\" \")","v":35},{"$f":"IFERROR(IF(ISNUMBER(T7),IF(S7 = S5, 0, AA7 + AC6),\" \"),\" \")","v":0},{"$f":"IFERROR(IF(ISNUMBER(T7),IF(S8 = S5, 0, IF(S8 = \"\", 0, AD8 + AB8)),\" \"),\" \")","v":0},{"$f":"IFERROR(IF(ISNUMBER(T7),AC7 + AD7,\" \"),\" \")","v":0}]
[3,"Customer 1",{"$f":"IFERROR(MATCH(B8,'1.Locations'!$B$2:$B$7, 0) - 1,\" \")","v":1},{"$f":"IFERROR(IF(ISNUMBER(C8),INDEX('2.Distances'!$C$2:$C$37,C7*6+C8 + 2) +D7,\" \"),\" \")","v":67},{"$f":"IFERROR(IF(ISNUMBER(C8),'3.Vehicles'!$F$2 * INDEX('2.Distances'!$D$2:$D$37,C7*6+C8 + 2) +E7,\" \"),\" \")","v":0},{"$f":"IFERROR(IF(ISNUMBER(C8),'3.Vehicles'!$F$2 * INDEX('2.Distances'!$D$2:$D$37,C7*6+C8 + 2) +G7,\" \"),\" \")","v":"00:00:00"},{"$f":"IFERROR(IF(AND(C5<>C8,ISNUMBER(F8)),INDEX('1.Locations'!$I$2:$I$7,C8 + 1) + MAX(F8,INDEX('1.Locations'!$F$2:$F$7,C8 + 1)),\" \"),\" \")","v":"00:00:00"},{"$f":"IFERROR(IF(AND(B8 = B5, B9 = \"\"), F8 - G5, G8 - G5),\" \")","v":0},{"$f":"IFERROR(IF(ISNUMBER(C8),INDEX('1.Locations'!$L$2:$L$7,C8 + 1) + I7,\" \"),\" \")","v":0},{"$f":"IFERROR(IF(ISNUMBER(C8),INDEX('1.Locations'!$J$2:$J$7,C8 + 1),\" \"),\" \")","v":0},{"$f":"IFERROR(IF(ISNUMBER(C8),INDEX('1.Locations'!$K$2:$K$7,C8 + 1),\" \"),\" \")","v":37},{"$f":"IFERROR(IF(ISNUMBER(C8),IF(B8 = B5, 0, J8 + L7),\" \"),\" \")","v":0},{"$f":"IFERROR(IF(ISNUMBER(C8),IF(B9 = B5, 0, IF(B9 = \"\", 0, M9 + K9)),\" \"),\" \")","v":0},{"$f":"IFERROR(IF(ISNUMBER(C8),L8 + M8,\" \"),\" \")","v":0},null,null,null,3,"Depot",{"$f":"IFERROR(MATCH(S8,'1.Locations'!$B$2:$B$7, 0) - 1,\" \")","v":0},{"$f":"IFERROR(IF(ISNUMBER(T8),INDEX('2.Distances'!$C$2:$C$37,T7*6+T8 + 2) +U7,\" \"),\" \")","v":76},{"$f":"IFERROR(IF(ISNUMBER(T8),'3.Vehicles'!$F$2 * INDEX('2.Distances'!$D$2:$D$37,T7*6+T8 + 2) +V7,\" \"),\" \")","v":0},{"$f":"IFERROR(IF(ISNUMBER(T8),'3.Vehicles'!$F$2 * INDEX('2.Distances'!$D$2:$D$37,T7*6+T8 + 2) +X7,\" \"),\" \")","v":"00:00:00"},{"$f":"IFERROR(IF(AND(T5<>T8,ISNUMBER(W8)),INDEX('1.Locations'!$I$2:$I$7,T8 + 1) + MAX(W8,INDEX('1.Locations'!$F$2:$F$7,T8 + 1)),\" \"),\" \")","v":" "},{"$f":"IFERROR(IF(AND(S8 = S5, S9 = \"\"), W8 - X5, X8 - X5),\" \")","v":0},{"$f":"IFERROR(IF(ISNUMBER(T8),INDEX('1.Locations'!$L$2:$L$7,T8 + 1) + Z7,\" \"),\" \")","v":0},{"$f":"IFERROR(IF(ISNUMBER(T8),INDEX('1.Locations'!$J$2:$J$7,T8 + 1),\" \"),\" \")","v":0},{"$f":"IFERROR(IF(ISNUMBER(T8),INDEX('1.Locations'!$K$2:$K$7,T8 + 1),\" \"),\" \")","v":0},{"$f":"IFERROR(IF(ISNUMBER(T8),IF(S8 = S5, 0, AA8 + AC7),\" \"),\" \")","v":0},{"$f":"IFERROR(IF(ISNUMBER(T8),IF(S9 = S5, 0, IF(S9 = \"\", 0, AD9 + AB9)),\" \"),\" \")","v":0},{"$f":"IFERROR(IF(ISNUMBER(T8),AC8 + AD8,\" \"),\" \")","v":0}]
{"$rows_left_out":5}